{"text_format":"1","workbook":"xlsx","n_sheets":11,"sheets":["Master","IE00B00G9Z55","IE00B2R0SK20","IE0034270375","IE00B2R0SM44","IE0030893295","IE00B1DPRZ29","IE00B2R0SD52","IE00B4Q6B737","IE00B61C7X84","IE00B4LFH886"],"not_rendered":{"charts":0,"images":0,"macros":1,"external_links":1,"defined_names":0,"comments":1,"pivot_tables":0},"unopened":[],"bounds":{"document_bytes":16777216,"sheet_cells":100000,"rows_first":2000,"rows_last":500,"rows_between":2000,"halvings":0,"cell_chars":16384,"cell_head_chars":4096},"cells_cut":0,"cells_raw":0,"read":"whole","date_system":"1900"}

{"sheet":"Master","index":0,"n_rows":12,"n_cols":11,"rows_kept":12,"cut":false,"hidden":false,"merged":[]}
["ISIN","Currency","CC","Type",null,null,null,null,"CC - Type"]
["IE00B00G9Z55","GBP",1770115,1,"ISIN","Currency","CC","Type",{"$f":"$C2&\" - \"&$D2","v":"1770115 - 1"},{"$f":"IF($K2=\"Missing from feeder\",\"Missing from feeder\",\"\")","v":""},{"$f":"IFERROR(HLOOKUP($I2,[1]Combined!$B$2:$WH$126,4,),\"Missing from feeder\")","v":39.88074597}]
["IE00B2R0SK20","EUR",1770115,3,"ISIN","Currency","CC","Type","1770115 - 3","",{"$f":"IFERROR(HLOOKUP($I3,[1]Combined!$B$2:$WH$126,4,),\"Missing from feeder\")","v":25.004725350000001}]
["IE0034270375","GBP",1770116,1,"ISIN","Currency","CC","Type","1770116 - 1","",{"$f":"IFERROR(HLOOKUP($I4,[1]Combined!$B$2:$WH$126,4,),\"Missing from feeder\")","v":21.337364749999999}]
["IE00B2R0SM44","GBP",1770116,2,"ISIN","Currency","CC","Type","1770116 - 2","",{"$f":"IFERROR(HLOOKUP($I5,[1]Combined!$B$2:$WH$126,4,),\"Missing from feeder\")","v":9.2298983499999991}]
["IE0030893295","EUR",1770117,1,"ISIN","Currency","CC","Type","1770117 - 1","",{"$f":"IFERROR(HLOOKUP($I6,[1]Combined!$B$2:$WH$126,4,),\"Missing from feeder\")","v":22.06045297}]
["IE00B1DPRZ29","EUR",1770117,2,"ISIN","Currency","CC","Type","1770117 - 2","",{"$f":"IFERROR(HLOOKUP($I7,[1]Combined!$B$2:$WH$126,4,),\"Missing from feeder\")","v":-23.056027749999998}]
["IE00B2R0SC46",null,1770117,3,"ISIN","Currency","CC","Type","1770117 - 3","",{"$f":"IFERROR(HLOOKUP($I8,[1]Combined!$B$2:$WH$126,4,),\"Missing from feeder\")","v":114.56761964}]
["IE00B2R0SD52","EUR",1770117,4,"ISIN","Currency","CC","Type","1770117 - 4","",{"$f":"IFERROR(HLOOKUP($I9,[1]Combined!$B$2:$WH$126,4,),\"Missing from feeder\")","v":14.258360529999999}]
["IE00B4Q6B737","USD",1770118,1,"ISIN","Currency","CC","Type","1770118 - 1","",{"$f":"IFERROR(HLOOKUP($I10,[1]Combined!$B$2:$WH$126,4,),\"Missing from feeder\")","v":25.81442766}]
["IE00B61C7X84","GBP",1770118,10,"ISIN","Currency","CC","Type","1770118 - 10","",{"$f":"IFERROR(HLOOKUP($I11,[1]Combined!$B$2:$WH$126,4,),\"Missing from feeder\")","v":14.48259764}]
["IE00B4LFH886","USD",1788120,1,"ISIN","Currency","CC","Type","1788120 - 1","",{"$f":"IFERROR(HLOOKUP($I12,[1]Combined!$B$2:$WH$126,4,),\"Missing from feeder\")","v":-2.0707042699999998}]

{"sheet":"IE00B00G9Z55","index":1,"n_rows":85,"n_cols":9,"rows_kept":85,"cut":false,"hidden":false,"merged":[]}
["ISIN","Currency","CC","Type"]
["IE00B00G9Z55","GBP",1770115,1,"1770115 - 1","TT EUROPE EX-UK EQUITY FU"]
[]
[null,null,null,null,"Old","New"]
["Date","ISIN","WKN","Currency","Share profits in %\n(Aktiengewinn) ","Share profits in %\n(Aktiengewinn) Corporation Tax Act *","Redemption Price","Interim Profit","ADDI"]
["2013-03-01","IE00B00G9Z55","n/a","GBP",39.88074597,39.884300000000003,22.384,0,2.6061899999999999E-2]
["2013-03-04","IE00B00G9Z55","n/a","GBP",39.722435679999997,39.752000000000002,22.321999999999999,0,2.6061899999999999E-2]
["2013-03-05","IE00B00G9Z55","n/a","GBP",40.750898419999999,40.7834,22.704000000000001,0,2.6061899999999999E-2]
["2013-03-06","IE00B00G9Z55","n/a","GBP",40.892020960000004,40.927199999999999,22.757999999999999,0,2.6061899999999999E-2]
["2013-03-07","IE00B00G9Z55","n/a","GBP",41.472876679999999,41.445399999999999,22.986000000000001,0,2.6061899999999999E-2]
["2013-03-08","IE00B00G9Z55","n/a","GBP",41.893076809999997,41.869100000000003,23.151,0,2.6061899999999999E-2]
["2013-03-11","IE00B00G9Z55","n/a","GBP",42.179092150000002,42.168700000000001,23.268000000000001,0,2.6061899999999999E-2]
["2013-03-12","IE00B00G9Z55","n/a","GBP",42.282603219999999,42.275199999999998,23.312000000000001,0,2.6061899999999999E-2]
["2013-03-13","IE00B00G9Z55","n/a","GBP",41.685407189999999,41.680300000000003,23.071000000000002,0,2.6061899999999999E-2]
["2013-03-14","IE00B00G9Z55","n/a","GBP",41.73671006,41.729900000000001,23.094000000000001,0,2.6061899999999999E-2]
["2013-03-15","IE00B00G9Z55","n/a","GBP",41.569848380000003,41.566400000000002,23.033999999999999,0,2.6061899999999999E-2]
["2013-03-19","IE00B00G9Z55","n/a","GBP",39.964285320000002,39.950600000000001,22.420999999999999,0,2.6061899999999999E-2]
["2013-03-20","IE00B00G9Z55","n/a","GBP",40.55656389,40.546199999999999,22.646000000000001,0,2.6061899999999999E-2]
["2013-03-21","IE00B00G9Z55","n/a","GBP",39.59279265,39.546700000000001,22.282,0,2.6061899999999999E-2]
["2013-03-22","IE00B00G9Z55","n/a","GBP",39.608147700000004,39.551499999999997,22.283999999999999,0,2.6061899999999999E-2]
{"$rows_left_out":66}
{"sheet":"IE00B2R0SK20","index":2,"n_rows":85,"n_cols":9,"rows_kept":85,"cut":false,"hidden":false,"merged":[]}
["ISIN","Currency","CC","Type"]
["IE00B2R0SK20","EUR",1770115,3,"1770115 - 3","TT EUROPE EX-UK EQUITY FU"]
[]
[null,null,null,null,"Old","New"]
["Date","ISIN","WKN","Currency","Share profits in %\n(Aktiengewinn) ","Share profits in %\n(Aktiengewinn) Corporation Tax Act *","Redemption Price","Interim Profit","ADDI"]
["2013-03-01","IE00B2R0SK20","n/a","EUR",25.004725350000001,25.008299999999998,12.423999999999999,0,0]
["2013-03-04","IE00B2R0SK20","n/a","EUR",24.805424479999999,24.835000000000001,12.414999999999999,0,0]
["2013-03-05","IE00B2R0SK20","n/a","EUR",26.084755120000001,26.117100000000001,12.651999999999999,0,0]
["2013-03-06","IE00B2R0SK20","n/a","EUR",26.260395219999999,26.295500000000001,12.653,0,0]
["2013-03-07","IE00B2R0SK20","n/a","EUR",26.98632881,26.9587,12.694000000000001,0,0]
["2013-03-08","IE00B2R0SK20","n/a","EUR",27.510229840000001,27.4862,12.782,0,0]
["2013-03-11","IE00B2R0SK20","n/a","EUR",27.868202369999999,27.857700000000001,12.79,0,0]
["2013-03-12","IE00B2R0SK20","n/a","EUR",27.998947909999998,27.991499999999998,12.795,0,0]
["2013-03-13","IE00B2R0SK20","n/a","EUR",27.252304639999998,27.2471,12.766,0,0]
["2013-03-14","IE00B2R0SK20","n/a","EUR",27.318107940000001,27.311199999999999,12.856999999999999,0,0]
["2013-03-15","IE00B2R0SK20","n/a","EUR",27.1134755,27.1099,12.805999999999999,0,0]
["2013-03-19","IE00B2R0SK20","n/a","EUR",25.113140739999999,25.099299999999999,12.627000000000001,0,0]
["2013-03-20","IE00B2R0SK20","n/a","EUR",25.852510580000001,25.841999999999999,12.705,0,0]
["2013-03-21","IE00B2R0SK20","n/a","EUR",24.648797179999999,24.602599999999999,12.563000000000001,0,0]
["2013-03-22","IE00B2R0SK20","n/a","EUR",24.66536932,24.608699999999999,12.544,0,0]
{"$rows_left_out":66}
{"sheet":"IE0034270375","index":3,"n_rows":85,"n_cols":9,"rows_kept":85,"cut":false,"hidden":false,"merged":[]}
["ISIN","Currency","CC","Type"]
["IE0034270375","GBP",1770116,1,"1770116 - 1","TT UK EQUITY FUND"]
[]
[null,null,null,null,"Old","New"]
["Date","ISIN","WKN","Currency","Share profits in %\n(Aktiengewinn) ","Share profits in %\n(Aktiengewinn) Corporation Tax Act *","Redemption Price","Interim Profit","ADDI"]
["2013-03-01","IE0034270375","n/a","GBP",21.337364749999999,21.340900000000001,19.041,0,2.4433030000000001E-2]
["2013-03-04","IE0034270375","n/a","GBP",20.938017349999999,20.945,18.946999999999999,0,2.4433030000000001E-2]
["2013-03-05","IE0034270375","n/a","GBP",22.021992220000001,22.0322,19.216999999999999,0,2.4433030000000001E-2]
["2013-03-06","IE0034270375","n/a","GBP",22.29005373,22.239599999999999,19.28,0,2.4433030000000001E-2]
["2013-03-07","IE0034270375","n/a","GBP",22.508915179999999,22.433199999999999,19.327000000000002,0,2.4433030000000001E-2]
["2013-03-08","IE0034270375","n/a","GBP",22.88683515,22.812200000000001,19.419,0,2.4433030000000001E-2]
["2013-03-11","IE0034270375","n/a","GBP",23.02220389,22.959399999999999,19.446999999999999,0,2.4433030000000001E-2]
["2013-03-12","IE0034270375","n/a","GBP",23.108600599999999,23.048999999999999,19.463000000000001,0,2.4433030000000001E-2]
["2013-03-13","IE0034270375","n/a","GBP",22.915638959999999,22.7225,19.43,0,2.4433030000000001E-2]
["2013-03-14","IE0034270375","n/a","GBP",23.373506509999999,23.184899999999999,19.559999999999999,0,2.4433030000000001E-2]
["2013-03-15","IE0034270375","n/a","GBP",22.96993814,22.781600000000001,19.449000000000002,0,2.4433030000000001E-2]
["2013-03-19","IE0034270375","n/a","GBP",22.66570076,22.489799999999999,19.39,0,2.4433030000000001E-2]
["2013-03-20","IE0034270375","n/a","GBP",22.884025829999999,22.515999999999998,19.439,0,2.4433030000000001E-2]
["2013-03-21","IE0034270375","n/a","GBP",22.119784800000001,21.7516,19.259,0,2.4433030000000001E-2]
["2013-03-22","IE0034270375","n/a","GBP",22.09762868,21.733699999999999,19.248999999999999,0,2.4433030000000001E-2]
{"$rows_left_out":66}
{"sheet":"IE00B2R0SM44","index":4,"n_rows":85,"n_cols":9,"rows_kept":85,"cut":false,"hidden":false,"merged":[]}
["ISIN","Currency","CC","Type"]
["IE00B2R0SM44","GBP",1770116,2,"1770116 - 2","TT UK EQUITY FUND"]
[]
[null,null,null,null,"Old","New"]
["Date","ISIN","WKN","Currency","Share profits in %\n(Aktiengewinn) ","Share profits in %\n(Aktiengewinn) Corporation Tax Act *","Redemption Price","Interim Profit","ADDI"]
["2013-03-01","IE00B2R0SM44","n/a","GBP",9.2298983499999991,9.2347000000000001,10.119,0,1.8293449999999999E-2]
["2013-03-04","IE00B2R0SM44","n/a","GBP",8.7707677799999999,8.7788000000000004,10.069000000000001,0,1.8293449999999999E-2]
["2013-03-05","IE00B2R0SM44","n/a","GBP",10.024724279999999,10.0372,10.212,0,1.8293449999999999E-2]
["2013-03-06","IE00B2R0SM44","n/a","GBP",10.33053563,10.2837,10.244999999999999,0,1.8293449999999999E-2]
["2013-03-07","IE00B2R0SM44","n/a","GBP",10.57716579,10.506500000000001,10.27,0,1.8293449999999999E-2]
["2013-03-08","IE00B2R0SM44","n/a","GBP",11.010922259999999,10.942600000000001,10.319000000000001,0,1.8293449999999999E-2]
["2013-03-11","IE00B2R0SM44","n/a","GBP",11.159662040000001,11.107200000000001,10.334,0,1.8293449999999999E-2]
["2013-03-12","IE00B2R0SM44","n/a","GBP",11.2544363,11.2065,10.342000000000001,0,1.8293449999999999E-2]
["2013-03-13","IE00B2R0SM44","n/a","GBP",11.039898969999999,10.8598,10.324,0,1.8293449999999999E-2]
["2013-03-14","IE00B2R0SM44","n/a","GBP",11.575627900000001,11.401300000000001,10.393000000000001,0,1.8293449999999999E-2]
["2013-03-15","IE00B2R0SM44","n/a","GBP",11.10363216,10.931100000000001,10.334,0,1.8293449999999999E-2]
["2013-03-19","IE00B2R0SM44","n/a","GBP",10.758501170000001,10.6038,10.302,0,1.8293449999999999E-2]
["2013-03-20","IE00B2R0SM44","n/a","GBP",11.005522559999999,10.659800000000001,10.327999999999999,0,1.8293449999999999E-2]
["2013-03-21","IE00B2R0SM44","n/a","GBP",10.12886447,9.7848000000000006,10.231999999999999,0,1.8293449999999999E-2]
["2013-03-22","IE00B2R0SM44","n/a","GBP",10.099401029999999,9.7609999999999992,10.227,0,1.8293449999999999E-2]
{"$rows_left_out":66}
{"sheet":"IE0030893295","index":5,"n_rows":85,"n_cols":9,"rows_kept":85,"cut":false,"hidden":false,"merged":[]}
["ISIN","Currency","CC","Type"]
["IE0030893295","EUR",1770117,1,"1770117 - 1","TT EUROPEAN EQUITY FUND"]
[]
[null,null,null,null,"Old","New"]
["Date","ISIN","WKN","Currency","Share profits in %\n(Aktiengewinn) ","Share profits in %\n(Aktiengewinn) Corporation Tax Act *","Redemption Price","Interim Profit","ADDI"]
["2013-03-01","IE0030893295","n/a","EUR",22.06045297,22.0642,12.308999999999999,0,1.3599999999999999E-2]
["2013-03-04","IE0030893295","n/a","EUR",21.915885280000001,21.934799999999999,12.285,0,1.3599999999999999E-2]
["2013-03-05","IE0030893295","n/a","EUR",23.42799192,23.45,12.535,0,1.3599999999999999E-2]
["2013-03-06","IE0030893295","n/a","EUR",23.46196496,23.4419,12.541,0,1.3599999999999999E-2]
["2013-03-07","IE0030893295","n/a","EUR",23.51477672,23.388500000000001,12.55,0,1.3599999999999999E-2]
["2013-03-08","IE0030893295","n/a","EUR",24.079173350000001,23.956299999999999,12.644,0,1.3599999999999999E-2]
["2013-03-11","IE0030893295","n/a","EUR",24.017290989999999,23.905899999999999,12.628,0,1.3599999999999999E-2]
["2013-03-12","IE0030893295","n/a","EUR",24.100564439999999,23.9879,12.641,0,1.3599999999999999E-2]
["2013-03-13","IE0030893295","n/a","EUR",24.07007449,23.878699999999998,12.641999999999999,0,1.3599999999999999E-2]
["2013-03-14","IE0030893295","n/a","EUR",24.802830870000001,24.621300000000002,12.771000000000001,0,1.3599999999999999E-2]
["2013-03-15","IE0030893295","n/a","EUR",24.521759599999999,24.346800000000002,12.712,0,1.3599999999999999E-2]
["2013-03-19","IE0030893295","n/a","EUR",23.73705914,23.54,12.590999999999999,0,1.3599999999999999E-2]
["2013-03-20","IE0030893295","n/a","EUR",24.202714709999999,24.011199999999999,12.664999999999999,0,1.3599999999999999E-2]
["2013-03-21","IE0030893295","n/a","EUR",23.48395202,23.2561,12.55,0,1.3599999999999999E-2]
["2013-03-22","IE0030893295","n/a","EUR",23.33590431,23.099699999999999,12.52,0,1.3599999999999999E-2]
{"$rows_left_out":66}
{"sheet":"IE00B1DPRZ29","index":6,"n_rows":85,"n_cols":9,"rows_kept":85,"cut":false,"hidden":false,"merged":[]}
["ISIN","Currency","CC","Type"]
["IE00B1DPRZ29","EUR",1770117,2,"1770117 - 2","TT EUROPEAN EQUITY FUND"]
[]
[null,null,null,null,"Old","New"]
["Date","ISIN","WKN","Currency","Share profits in %\n(Aktiengewinn) ","Share profits in %\n(Aktiengewinn) Corporation Tax Act *","Redemption Price","Interim Profit","ADDI"]
["2013-03-01","IE00B1DPRZ29","n/a","EUR",-23.056027749999998,-23.050999999999998,8.1240000000000006,0,1.17E-2]
["2013-03-04","IE00B1DPRZ29","n/a","EUR",-23.292877189999999,-23.267900000000001,8.1080000000000005,0,1.17E-2]
["2013-03-05","IE00B1DPRZ29","n/a","EUR",-20.880906249999999,-20.851600000000001,8.2729999999999997,0,1.17E-2]
["2013-03-06","IE00B1DPRZ29","n/a","EUR",-20.829069459999999,-20.840499999999999,8.2759999999999998,0,1.17E-2]
["2013-03-07","IE00B1DPRZ29","n/a","EUR",-20.744106309999999,-20.860399999999998,8.2829999999999995,0,1.17E-2]
["2013-03-08","IE00B1DPRZ29","n/a","EUR",-19.853705770000001,-19.965399999999999,8.3439999999999994,0,1.17E-2]
["2013-03-11","IE00B1DPRZ29","n/a","EUR",-19.970193949999999,-20.070699999999999,8.3339999999999996,0,1.17E-2]
["2013-03-12","IE00B1DPRZ29","n/a","EUR",-19.843487199999998,-19.943899999999999,8.3420000000000005,0,1.17E-2]
["2013-03-13","IE00B1DPRZ29","n/a","EUR",-19.88013965,-20.052900000000001,8.3420000000000005,0,1.17E-2]
["2013-03-14","IE00B1DPRZ29","n/a","EUR",-18.703569609999999,-18.865300000000001,8.4269999999999996,0,1.17E-2]
["2013-03-15","IE00B1DPRZ29","n/a","EUR",-19.183638510000002,-19.342099999999999,8.3879999999999999,0,1.17E-2]
["2013-03-19","IE00B1DPRZ29","n/a","EUR",-20.400970059999999,-20.570799999999998,8.3079999999999998,0,1.17E-2]
["2013-03-20","IE00B1DPRZ29","n/a","EUR",-19.678715539999999,-19.841799999999999,8.3559999999999999,0,1.17E-2]
["2013-03-21","IE00B1DPRZ29","n/a","EUR",-20.800063210000001,-20.997900000000001,8.2810000000000006,0,1.17E-2]
["2013-03-22","IE00B1DPRZ29","n/a","EUR",-21.050969299999998,-21.260400000000001,8.2609999999999992,0,1.17E-2]
{"$rows_left_out":66}
{"sheet":"IE00B2R0SD52","index":7,"n_rows":85,"n_cols":9,"rows_kept":85,"cut":false,"hidden":false,"merged":[]}
["ISIN","Currency","CC","Type"]
["IE00B2R0SD52","EUR",1770117,4,"1770117 - 4","TT EUROPEAN EQUITY FUND"]
[]
[null,null,null,null,"Old","New"]
["Date","ISIN","WKN","Currency","Share profits in %\n(Aktiengewinn) ","Share profits in %\n(Aktiengewinn) Corporation Tax Act *","Redemption Price","Interim Profit","ADDI"]
["2013-03-01","IE00B2R0SD52","n/a","EUR",14.258360529999999,14.263400000000001,12.29,0,0.187]
["2013-03-04","IE00B2R0SD52","n/a","EUR",14.09117651,14.1204,12.266,0,0.187]
["2013-03-05","IE00B2R0SD52","n/a","EUR",15.75818147,15.791600000000001,12.515000000000001,0,0.187]
["2013-03-06","IE00B2R0SD52","n/a","EUR",15.79438334,15.7872,12.52,0,0.187]
["2013-03-07","IE00B2R0SD52","n/a","EUR",15.85588093,15.739100000000001,12.53,0,0.187]
["2013-03-08","IE00B2R0SD52","n/a","EUR",16.475869100000001,16.363700000000001,12.624000000000001,0,0.187]
["2013-03-11","IE00B2R0SD52","n/a","EUR",16.401123869999999,16.304400000000001,12.606999999999999,0,0.187]
["2013-03-12","IE00B2R0SD52","n/a","EUR",16.4910727,16.394500000000001,12.62,0,0.187]
["2013-03-13","IE00B2R0SD52","n/a","EUR",16.4555066,16.2866,12.62,0,0.187]
["2013-03-14","IE00B2R0SD52","n/a","EUR",17.264312820000001,17.106300000000001,12.749000000000001,0,0.187]
["2013-03-15","IE00B2R0SD52","n/a","EUR",16.951812919999998,16.795999999999999,12.69,0,0.187]
["2013-03-19","IE00B2R0SD52","n/a","EUR",16.085460609999998,15.9184,12.568,0,0.187]
["2013-03-20","IE00B2R0SD52","n/a","EUR",16.59475256,16.4344,12.641999999999999,0,0.187]
["2013-03-21","IE00B2R0SD52","n/a","EUR",15.805315419999999,15.610300000000001,12.526999999999999,0,0.187]
["2013-03-22","IE00B2R0SD52","n/a","EUR",15.64193908,15.434900000000001,12.497999999999999,0,0.187]
{"$rows_left_out":66}
{"sheet":"IE00B4Q6B737","index":8,"n_rows":85,"n_cols":9,"rows_kept":85,"cut":false,"hidden":false,"merged":[]}
["ISIN","Currency","CC","Type"]
["IE00B4Q6B737","USD",1770118,1,"1770118 - 1","TT ASIA-PACIFIC EQUITY FU"]
[]
[null,null,null,null,"Old","New"]
["Date","ISIN","WKN","Currency","Share profits in %\n(Aktiengewinn) ","Share profits in %\n(Aktiengewinn) Corporation Tax Act *","Redemption Price","Interim Profit","ADDI"]
["2013-03-01","IE00B4Q6B737","n/a","USD",25.81442766,25.8123,12.427,0,2.8E-3]
["2013-03-04","IE00B4Q6B737","n/a","USD",24.60604335,24.532299999999999,12.221,0,2.8E-3]
["2013-03-05","IE00B4Q6B737","n/a","USD",25.334407980000002,25.276900000000001,12.356,0,2.8E-3]
["2013-03-06","IE00B4Q6B737","n/a","USD",25.991903409999999,25.891200000000001,12.483000000000001,0,2.8E-3]
["2013-03-07","IE00B4Q6B737","n/a","USD",25.74572543,25.646100000000001,12.457000000000001,0,2.8E-3]
["2013-03-08","IE00B4Q6B737","n/a","USD",25.871459059999999,25.808,12.497999999999999,0,2.8E-3]
["2013-03-11","IE00B4Q6B737","n/a","USD",25.993924239999998,25.947199999999999,12.523999999999999,0,2.8E-3]
["2013-03-12","IE00B4Q6B737","n/a","USD",25.655435820000001,25.614100000000001,12.468,0,2.8E-3]
["2013-03-13","IE00B4Q6B737","n/a","USD",25.084064949999998,25.0367,12.362,0,2.8E-3]
["2013-03-14","IE00B4Q6B737","n/a","USD",24.932211859999999,24.889700000000001,12.342000000000001,0,2.8E-3]
["2013-03-15","IE00B4Q6B737","n/a","USD",25.062187389999998,25.0228,12.356,0,2.8E-3]
["2013-03-19","IE00B4Q6B737","n/a","USD",24.040497569999999,24.012899999999998,12.166,0,2.8E-3]
["2013-03-20","IE00B4Q6B737","n/a","USD",24.05594382,23.984500000000001,12.164,0,2.8E-3]
["2013-03-21","IE00B4Q6B737","n/a","USD",23.996769090000001,23.927299999999999,12.148,0,2.8E-3]
["2013-03-22","IE00B4Q6B737","n/a","USD",23.92418267,23.8596,12.134,0,2.8E-3]
{"$rows_left_out":66}
{"sheet":"IE00B61C7X84","index":9,"n_rows":85,"n_cols":9,"rows_kept":85,"cut":false,"hidden":false,"merged":[]}
["ISIN","Currency","CC","Type"]
["IE00B61C7X84","GBP",1770118,10,"1770118 - 10","TT ASIA-PACIFIC EQUITY FU"]
[]
[null,null,null,null,"Old","New"]
["Date","ISIN","WKN","Currency","Share profits in %\n(Aktiengewinn) ","Share profits in %\n(Aktiengewinn) Corporation Tax Act *","Redemption Price","Interim Profit","ADDI"]
["2013-03-01","IE00B61C7X84","n/a","GBP",14.48259764,14.480499999999999,12.227,0,7.5679739999999995E-2]
["2013-03-04","IE00B61C7X84","n/a","GBP",13.083109779999999,13.009399999999999,11.976000000000001,0,7.5679739999999995E-2]
["2013-03-05","IE00B61C7X84","n/a","GBP",13.93687991,13.8794,12.068,0,7.5679739999999995E-2]
["2013-03-06","IE00B61C7X84","n/a","GBP",14.71034246,14.6096,12.246,0,7.5679739999999995E-2]
["2013-03-07","IE00B61C7X84","n/a","GBP",14.440555740000001,14.3409,12.225,0,7.5679739999999995E-2]
["2013-03-08","IE00B61C7X84","n/a","GBP",14.604066489999999,14.5406,12.365,0,7.5679739999999995E-2]
["2013-03-11","IE00B61C7X84","n/a","GBP",14.75002651,14.7034,12.414,0,7.5679739999999995E-2]
["2013-03-12","IE00B61C7X84","n/a","GBP",14.360700599999999,14.3194,12.37,0,7.5679739999999995E-2]
["2013-03-13","IE00B61C7X84","n/a","GBP",13.692304480000001,13.6449,12.231999999999999,0,7.5679739999999995E-2]
["2013-03-14","IE00B61C7X84","n/a","GBP",13.52236796,13.479900000000001,12.109,0,7.5679739999999995E-2]
["2013-03-15","IE00B61C7X84","n/a","GBP",13.66511045,13.6257,12.06,0,7.5679739999999995E-2]
["2013-03-19","IE00B61C7X84","n/a","GBP",12.46492881,12.4373,11.885999999999999,0,7.5679739999999995E-2]
["2013-03-20","IE00B61C7X84","n/a","GBP",12.47900417,12.4076,11.872,0,7.5679739999999995E-2]
["2013-03-21","IE00B61C7X84","n/a","GBP",12.4044767,12.335000000000001,11.819000000000001,0,7.5679739999999995E-2]
["2013-03-22","IE00B61C7X84","n/a","GBP",12.318052290000001,12.253500000000001,11.759,0,7.5679739999999995E-2]
{"$rows_left_out":66}
{"sheet":"IE00B4LFH886","index":10,"n_rows":85,"n_cols":9,"rows_kept":85,"cut":false,"hidden":false,"merged":[]}
["ISIN","Currency","CC","Type"]
["IE00B4LFH886","USD",1788120,1,"1788120 - 1","TT EMERGING MARKETS EQUITY"]
[]
[null,null,null,null,"Old","New"]
["Date","ISIN","WKN","Currency","Share profits in %\n(Aktiengewinn) ","Share profits in %\n(Aktiengewinn) Corporation Tax Act *","Redemption Price","Interim Profit","ADDI"]
["2013-03-01","IE00B4LFH886","n/a","USD",-2.0707042699999998,-2.0613000000000001,9.6039999999999992,0,4.3851510000000003E-2]
["2013-03-04","IE00B4LFH886","n/a","USD",-2.9997924299999998,-2.9782999999999999,9.5210000000000008,0,4.3851510000000003E-2]
["2013-03-05","IE00B4LFH886","n/a","USD",-2.0028762900000001,-1.9741,9.6210000000000004,0,4.3851510000000003E-2]
["2013-03-06","IE00B4LFH886","n/a","USD",-0.93850783999999998,-0.91700000000000004,9.73,0,4.3851510000000003E-2]
["2013-03-07","IE00B4LFH886","n/a","USD",-1.2781506600000001,-1.2521,9.7010000000000005,0,4.3851510000000003E-2]
["2013-03-08","IE00B4LFH886","n/a","USD",-0.71365734999999997,-0.68179999999999996,9.7609999999999992,0,4.3851510000000003E-2]
["2013-03-11","IE00B4LFH886","n/a","USD",-1.0049486299999999,-0.96319999999999995,9.7360000000000007,0,4.3851510000000003E-2]
["2013-03-12","IE00B4LFH886","n/a","USD",-1.52881636,-1.4810000000000001,9.6929999999999996,0,4.3851510000000003E-2]
["2013-03-13","IE00B4LFH886","n/a","USD",-2.1605015999999999,-2.1105999999999998,9.6289999999999996,0,4.3851510000000003E-2]
["2013-03-14","IE00B4LFH886","n/a","USD",-1.87932956,-1.8227,9.6530000000000005,0,4.3851510000000003E-2]
["2013-03-15","IE00B4LFH886","n/a","USD",-1.43803379,-1.3755999999999999,9.6850000000000005,0,4.3851510000000003E-2]
["2013-03-19","IE00B4LFH886","n/a","USD",-2.8718286499999999,-2.7928000000000002,9.5449999999999999,0,4.3851510000000003E-2]
["2013-03-20","IE00B4LFH886","n/a","USD",-2.59100354,-2.5102000000000002,9.56,0,4.3851510000000003E-2]
["2013-03-21","IE00B4LFH886","n/a","USD",-3.0445479600000001,-2.9681000000000002,9.5169999999999995,0,4.3851510000000003E-2]
["2013-03-22","IE00B4LFH886","n/a","USD",-3.22599013,-3.1576,9.5,0,4.3851510000000003E-2]
{"$rows_left_out":65}